BDBM50351917 CHEMBL1821808
SMILES CC(C)(C)C#Cc1ccccc1-c1ccc2nc(N)ccc2c1
InChI Key InChIKey=IFUYBWIZKMAADM-UHFFFAOYSA-N
Data  1 Kd
PDB links: 1 PDB ID matches this monomer.
  Tab Delimited (TSV)   2D SDfile   Computed 3D by Vconf -m prep SDfile
Find this compound or compounds like it in BindingDB:
Activity Spreadsheet -- Enzyme Inhibition Constant Data from BindingDB
Found 1 hit for monomerid = 50351917
TargetBeta-secretase 1(Homo sapiens (Human))
Amgen
Curated by ChEMBL
LigandPNGBDBM50351917(CHEMBL1821808)
Affinity DataKd:  6.10E+3nM. Assay description: Binding affinity to BACE1 after 90 seconds by surface plasmon resonance assay