BDBM50352218 CHEMBL1821863
SMILES Cc1ccc(cc1C)C1=NN(C(C1)c1ccc(Cl)cc1)c1nc(cs1)-c1ccccc1
InChI Key InChIKey=YZVSCCMTUKESSP-UHFFFAOYSA-N
Data  1 IC50
  Tab Delimited (TSV)   2D SDfile   Computed 3D by Vconf -m prep SDfile
Find this compound or compounds like it in BindingDB:
Activity Spreadsheet -- Enzyme Inhibition Constant Data from BindingDB
Found 1 hit for monomerid = 50352218
TargetEpidermal growth factor receptor(Homo sapiens (Human))
Nanjing University
Curated by ChEMBL
LigandPNGBDBM50352218(CHEMBL1821863)
Affinity DataIC50:  2.36E+3nM. Assay description: Inhibition of recombinant (His)6-tagged EGFR cytoplasmic domain (645-1186) autophosphorylation pre-incubated for 10 mins measured after 1 hrs by DELF...
In DepthDetails ArticlePubMed