BDBM50352663 CHEMBL1823077
SMILES COc1ccc(cc1)-n1c(C)c(nc1-c1ccccc1)C(=O)NCCCN1CCN(CC1)c1cccc(C)c1C
InChI Key InChIKey=PYFKQSZWRFFTJK-UHFFFAOYSA-N
Data  3 IC50
  Tab Delimited (TSV)   2D SDfile   Computed 3D by Vconf -m prep SDfile
Find this compound or compounds like it in BindingDB:
Activity Spreadsheet -- Enzyme Inhibition Constant Data from BindingDB
Found 3 hits for monomerid = 50352663
Target5-hydroxytryptamine receptor 2A(Homo sapiens (Human))
Green Cross
Curated by ChEMBL
LigandPNGBDBM50352663(CHEMBL1823077)
Affinity DataIC50:  24nM. Assay description: Displacement of [3H]ketanserin from human recombinant serotonin 5-HT2A receptor expressed in CHO-K1 cells
In DepthDetails ArticlePubMed
TargetSodium-dependent serotonin transporter(Homo sapiens (Human))
Green Cross
Curated by ChEMBL
LigandPNGBDBM50352663(CHEMBL1823077)
Affinity DataIC50:  12nM. Assay description: Displacement of [3H]impiramine from human serotonin transporter membrane expressed in HEK293 cells
In DepthDetails ArticlePubMed
Target5-hydroxytryptamine receptor 2C(Homo sapiens (Human))
Green Cross
Curated by ChEMBL
LigandPNGBDBM50352663(CHEMBL1823077)
Affinity DataIC50:  96nM. Assay description: Displacement of [3H]mesulergine from human recombinant 5-HT2C receptor expressed in CHO-K1 cells
In DepthDetails ArticlePubMed