BDBM50352677 CHEMBL1823091
SMILES Cc1nc(C(=O)NCCCN2CCN(CC2)c2cccc(C)c2C)c(C)n1-c1cccc(Cl)c1
InChI Key InChIKey=LEWGOTLJSGCKES-UHFFFAOYSA-N
Data  3 IC50
  Tab Delimited (TSV)   2D SDfile   Computed 3D by Vconf -m prep SDfile
Find this compound or compounds like it in BindingDB:
Activity Spreadsheet -- Enzyme Inhibition Constant Data from BindingDB
Found 3 hits for monomerid = 50352677
Target5-hydroxytryptamine receptor 2A(Homo sapiens (Human))
Green Cross
Curated by ChEMBL
LigandPNGBDBM50352677(CHEMBL1823091)
Affinity DataIC50:  96.8nM. Assay description: Displacement of [3H]ketanserin from human recombinant serotonin 5-HT2A receptor expressed in CHO-K1 cells
In DepthDetails ArticlePubMed
TargetSodium-dependent serotonin transporter(Homo sapiens (Human))
Green Cross
Curated by ChEMBL
LigandPNGBDBM50352677(CHEMBL1823091)
Affinity DataIC50:  4.88nM. Assay description: Displacement of [3H]impiramine from human serotonin transporter membrane expressed in HEK293 cells
In DepthDetails ArticlePubMed
Target5-hydroxytryptamine receptor 2C(Homo sapiens (Human))
Green Cross
Curated by ChEMBL
LigandPNGBDBM50352677(CHEMBL1823091)
Affinity DataIC50:  111nM. Assay description: Displacement of [3H]mesulergine from human recombinant 5-HT2C receptor expressed in CHO-K1 cells
In DepthDetails ArticlePubMed