BDBM503529 N-{cis-3-[(4-{N-[(7S)-4- fluorobicyclo[4.2.0]octa-1,3,5-trien- 7-yl]-N'-hydroxycarbamimidoyl}- 1,2,5-oxadiazol-3- yl)oxy]cyclobutyl}acetamide::US11034661, Example 36
SMILES CC(=O)N[C@H]1C[C@H](C1)Oc1nonc1\C(N[C@H]1Cc2ccc(F)cc12)=N\O
InChI Key InChIKey=OSTVHZNBOXHTKQ-SCRDCRAPSA-N
Data  1 IC50
  Tab Delimited (TSV)   2D SDfile   Computed 3D by Vconf -m prep SDfile
Find this compound or compounds like it in BindingDB:
Activity Spreadsheet -- Enzyme Inhibition Constant Data from BindingDB
Found 1 hit for monomerid = 503529
TargetIndoleamine 2,3-dioxygenase 1(Homo sapiens (Human))
Merck Sharp & Dohme
US Patent
LigandPNGBDBM503529(N-{cis-3-[(4-{N-[(7S)-4- fluorobicyclo[4.2.0]octa...)
Affinity DataIC50:  50.7nM. Assay description: HIS-tagged IDO1 protein was recombinantly expressed in Escherichia coli using ZYP5052 autoinduction media supplemented with 500 μM delta aminole...
Ligand InfoPC cidPC sid
In DepthDetails US Patent