BDBM50353048 CHEMBL1822527
SMILES COc1cc(ccc1Nc1ncc2ccc(-c3ccccc3N(C)S(C)(=O)=O)n2n1)N1CCC(CC1)N1CCOCC1
InChI Key InChIKey=HCQWDCIGBDDWLZ-UHFFFAOYSA-N
Data  3 IC50
  Tab Delimited (TSV)   2D SDfile   Computed 3D by Vconf -m prep SDfile
Find this compound or compounds like it in BindingDB:
Activity Spreadsheet -- Enzyme Inhibition Constant Data from BindingDB
Found 3 hits for monomerid = 50353048
TargetALK tyrosine kinase receptor/Nucleophosmin(Homo sapiens (Human))
Cephalon
Curated by ChEMBL
LigandPNGBDBM50353048(CHEMBL1822527)
Affinity DataIC50:  50nM. Assay description: Inhibition of NPM/ALK phosphorylation in human KARPAS299 cells by ELISA
In DepthDetails ArticlePubMed
TargetALK tyrosine kinase receptor(Homo sapiens (Human))
Cephalon
Curated by ChEMBL
LigandPNGBDBM50353048(CHEMBL1822527)
Affinity DataIC50:  7nM. Assay description: Inhibition of human recombinant ALK assessed as phosphorylated product using PLC-gamma/GST substrate by modified ELISA method
In DepthDetails ArticlePubMed
TargetInsulin receptor(Homo sapiens (Human))
Cephalon
Curated by ChEMBL
LigandPNGBDBM50353048(CHEMBL1822527)
Affinity DataIC50:  809nM. Assay description: Inhibition of IR
In DepthDetails ArticlePubMed