BDBM50353165 CHEMBL1829472
SMILES C[C@@H]1CCCN1CCCOc1ccc(cc1)-c1ccc(=O)n(n1)-c1ncccn1
InChI Key InChIKey=JFHYZQNXNHZARY-QGZVFWFLSA-N
Data  2 KI  6 IC50
  Tab Delimited (TSV)   2D SDfile   Computed 3D by Vconf -m prep SDfile
Find this compound or compounds like it in BindingDB:
Activity Spreadsheet -- Enzyme Inhibition Constant Data from BindingDB
Found 8 hits for monomerid = 50353165
TargetHistamine H3 receptor(Homo sapiens (Human))
Cephalon
Curated by ChEMBL
LigandPNGBDBM50353165(CHEMBL1829472)
Affinity DataKi:  1.40nM. Assay description: Displacement of [3H]NAMH from human cloned histamine 3 receptor expressed in CHO cells
In DepthDetails ArticlePubMed
TargetHistamine H3 receptor(Rattus norvegicus (rat))
Cephalon
Curated by ChEMBL
LigandPNGBDBM50353165(CHEMBL1829472)
Affinity DataKi:  7.90nM. Assay description: Displacement of [3H]NAMH from rat cloned histamine 3 receptor expressed in CHO cells
In DepthDetails ArticlePubMed
TargetCytochrome P450 2D6(Homo sapiens (Human))
Cephalon
Curated by ChEMBL
LigandPNGBDBM50353165(CHEMBL1829472)
Affinity DataIC50: >3.00E+4nM. Assay description: Inhibition of CYP2D6
In DepthDetails ArticlePubMed
TargetCytochrome P450 3A4(Homo sapiens (Human))
Cephalon
Curated by ChEMBL
LigandPNGBDBM50353165(CHEMBL1829472)
Affinity DataIC50: >3.00E+4nM. Assay description: Inhibition of CYP3A4
In DepthDetails ArticlePubMed
TargetPotassium voltage-gated channel subfamily H member 2(Homo sapiens (Human))
Cephalon
Curated by ChEMBL
LigandPNGBDBM50353165(CHEMBL1829472)
Affinity DataIC50: >1.00E+4nM. Assay description: Inhibition of human ERG by patch express assay
In DepthDetails ArticlePubMed
TargetCytochrome P450 2C9(Homo sapiens (Human))
Cephalon
Curated by ChEMBL
LigandPNGBDBM50353165(CHEMBL1829472)
Affinity DataIC50: >3.00E+4nM. Assay description: Inhibition of CYP2C9
In DepthDetails ArticlePubMed
TargetCytochrome P450 1A2(Homo sapiens (Human))
Cephalon
Curated by ChEMBL
LigandPNGBDBM50353165(CHEMBL1829472)
Affinity DataIC50: >3.00E+4nM. Assay description: Inhibition of CYP1A2
In DepthDetails ArticlePubMed
TargetCytochrome P450 2C19(Homo sapiens (Human))
Cephalon
Curated by ChEMBL
LigandPNGBDBM50353165(CHEMBL1829472)
Affinity DataIC50: >3.00E+4nM. Assay description: Inhibition of CYP2C19
In DepthDetails ArticlePubMed