BDBM50353719 CHEMBL1830833
SMILES Clc1ccc(NNC(=O)c2cc3ccccc3oc2=O)cc1
InChI Key InChIKey=XCHALBKFILSDCE-UHFFFAOYSA-N
Data  2 IC50
  Tab Delimited (TSV)   2D SDfile   Computed 3D by Vconf -m prep SDfile
Find this compound or compounds like it in BindingDB:
Activity Spreadsheet -- Enzyme Inhibition Constant Data from BindingDB
Found 2 hits for monomerid = 50353719
TargetAmine oxidase [flavin-containing] A(Homo sapiens (Human))
Sapienza University Of Rome
Curated by ChEMBL
LigandPNGBDBM50353719(CHEMBL1830833)
Affinity DataIC50:  4.80E+4nM. Assay description: Inhibition of human recombinant MAO-A expressed in baculovirus infected BTI-TN-5B1-4 cells assessed as production of hydrogen peroxide from p-tyramin...
In DepthDetails ArticlePubMed
TargetAmine oxidase [flavin-containing] B(Homo sapiens (Human))
Sapienza University Of Rome
Curated by ChEMBL
LigandPNGBDBM50353719(CHEMBL1830833)
Affinity DataIC50:  1.19E+3nM. Assay description: Inhibition of human recombinant MAO-B expressed in baculovirus infected BTI-TN-5B1-4 cells assessed as production of hydrogen peroxide from p-tyramin...
In DepthDetails ArticlePubMed