BDBM50353726 CHEMBL1830795
SMILES CC(=O)c1cc2cc(Cl)ccc2oc1=O
InChI Key InChIKey=VYMAEQZQRVDKQZ-UHFFFAOYSA-N
Data  1 IC50
  Tab Delimited (TSV)   2D SDfile   Computed 3D by Vconf -m prep SDfile
Find this compound or compounds like it in BindingDB:
Activity Spreadsheet -- Enzyme Inhibition Constant Data from BindingDB
Found 1 hit for monomerid = 50353726
TargetAmine oxidase [flavin-containing] B(Homo sapiens (Human))
Sapienza University Of Rome
Curated by ChEMBL
LigandPNGBDBM50353726(CHEMBL1830795)
Affinity DataIC50:  1.77E+4nM. Assay description: Inhibition of human recombinant MAO-B expressed in baculovirus infected BTI-TN-5B1-4 cells assessed as production of hydrogen peroxide from p-tyramin...
In DepthDetails ArticlePubMed