BDBM50353893 CHEMBL1829090::US9006187, 34
SMILES CCc1ccc(Cc2sc([C@@H]3O[C@H](CO)[C@@H](O)[C@H](O)[C@H]3O)c(C)c2C)cc1
InChI Key InChIKey=TWEWMTALRDAMPI-XIKSMUEASA-N
Data  2 IC50
  Tab Delimited (TSV)   2D SDfile   Computed 3D by Vconf -m prep SDfile
Find this compound or compounds like it in BindingDB:
Activity Spreadsheet -- Enzyme Inhibition Constant Data from BindingDB
Found 2 hits for monomerid = 50353893
TargetSodium/glucose cotransporter 2(Homo sapiens (Human))
Green Cross
Curated by ChEMBL
LigandPNGBDBM50353893(CHEMBL1829090 | US9006187, 34)
Affinity DataIC50:  29.3nM. Assay description: Inhibition of human SGLT2 expressed in CHO cells assessed as [14C]-alpha-methyl-D-glucopyranoside uptake after 2 hrs by liquid scintillation counting
In DepthDetails ArticlePubMed
TargetSodium/glucose cotransporter 2(Homo sapiens (Human))
Green Cross
Curated by ChEMBL
LigandPNGBDBM50353893(CHEMBL1829090 | US9006187, 34)
Affinity DataIC50:  29.3nMpH: 7.4 T: 2°C. Assay description: For sodium-dependent glucose transport assay, cells expressing hSGLT2 were seeded into a 96-well culture plate at a density of 5x104 cells/well in RP...
In DepthDetails US Patent