BDBM50354061 CHEMBL1836340
SMILES COC(=O)[C@@H](NC(C)=O)[C@@H](C)O[C@H]1O[C@H](CO[C@@]2(C[C@H](O)[C@@H](NC(C)=O)[C@@H](O2)[C@H](O)[C@H](O)CO)C([O-])=O)[C@H](O)[C@H](O[C@@H]2O[C@H](CO)[C@H](O)[C@H](O[C@@]3(C[C@H](O)[C@@H](NC(C)=O)[C@@H](O3)[C@H](O)[C@H](O)CNC(=O)c3ccc(F)cc3)C([O-])=O)[C@H]2O)[C@H]1NC(C)=O
InChI Key InChIKey=XDSMZTJWMPGSCW-LBGNRLKDSA-L
Data  1 IC50  1 Kd
  Tab Delimited (TSV)   2D SDfile   Computed 3D by Vconf -m prep SDfile
Find this compound or compounds like it in BindingDB:
Activity Spreadsheet -- Enzyme Inhibition Constant Data from BindingDB
Found 2 hits for monomerid = 50354061
TargetMyelin-associated glycoprotein(Homo sapiens (Human))
The Scripps Research Institute
Curated by ChEMBL
LigandPNGBDBM50354061(CHEMBL1836340)
Affinity DataKd:  480nM. Assay description: Binding affinity to wild type MAG at 400 uM by Isothermal titration calorimetry
In DepthDetails ArticlePubMed
TargetMyelin-associated glycoprotein(Homo sapiens (Human))
The Scripps Research Institute
Curated by ChEMBL
LigandPNGBDBM50354061(CHEMBL1836340)
Affinity DataIC50:  300nM. Assay description: Inhibition of MAG -Fc chimera expressed in CHO cells using NeuAc alpha2-3Galbeta1-4GlcNAc-R coupled biotinylated polyacrylamide after 30 mins by ELIS...
In DepthDetails ArticlePubMed