BDBM50354966 CHEMBL1836931
SMILES COc1ccc(c(C)c1)-n1cnc2c(NC(C3CC3)C3CC3)nc(C)nc12
InChI Key InChIKey=RCQLVHRIOXVLQM-UHFFFAOYSA-N
Data  1 KI
  Tab Delimited (TSV)   2D SDfile   Computed 3D by Vconf -m prep SDfile
Find this compound or compounds like it in BindingDB:
Activity Spreadsheet -- Enzyme Inhibition Constant Data from BindingDB
Found 1 hit for monomerid = 50354966
TargetCorticotropin-releasing factor receptor 1(Homo sapiens (Human))
Pfizer
Curated by ChEMBL
LigandPNGBDBM50354966(CHEMBL1836931)
Affinity DataKi:  47nM. Assay description: Antagonist activity at recombinant human CRF1 receptor expressed in CHO cells assessed as inhibition of CRF-induced cAMP formation
In DepthDetails ArticlePubMed