BDBM50354974 CHEMBL1836939
SMILES Cc1nc2c(NC(C3CC3)C3CC3)nc(C)nc2n1-c1ccc(cc1)C#N
InChI Key InChIKey=LAKFONGEXFWJAI-UHFFFAOYSA-N
Data  1 KI
  Tab Delimited (TSV)   2D SDfile   Computed 3D by Vconf -m prep SDfile
Find this compound or compounds like it in BindingDB:
Activity Spreadsheet -- Enzyme Inhibition Constant Data from BindingDB
Found 1 hit for monomerid = 50354974
TargetCorticotropin-releasing factor receptor 1(Homo sapiens (Human))
Pfizer
Curated by ChEMBL
LigandPNGBDBM50354974(CHEMBL1836939)
Affinity DataKi:  62nM. Assay description: Antagonist activity at recombinant human CRF1 receptor expressed in CHO cells assessed as inhibition of CRF-induced cAMP formation
In DepthDetails ArticlePubMed