BDBM50355037 CHEMBL1835478
SMILES CC(=O)Oc1ccc(cc1)-c1cc(nn1-c1ccc(cc1)S(C)(=O)=O)C(F)(F)F
InChI Key InChIKey=BGGDLYCFNNWGEW-UHFFFAOYSA-N
Data  2 IC50
  Tab Delimited (TSV)   2D SDfile   Computed 3D by Vconf -m prep SDfile
Find this compound or compounds like it in BindingDB:
Activity Spreadsheet -- Enzyme Inhibition Constant Data from BindingDB
Found 2 hits for monomerid = 50355037
TargetProstaglandin G/H synthase 2(Ovis aries (Sheep))
University Of Alberta
Curated by ChEMBL
LigandPNGBDBM50355037(CHEMBL1835478)
Affinity DataIC50:  4.10E+3nM. Assay description: Inhibition of ovine COX2 by enzyme immuno assay
In DepthDetails ArticlePubMed
TargetProstaglandin G/H synthase 1(Ovis aries (Sheep))
University Of Alberta
Curated by ChEMBL
LigandPNGBDBM50355037(CHEMBL1835478)
Affinity DataIC50:  8.03E+4nM. Assay description: Inhibition of ovine COX1 by enzyme immuno assay
In DepthDetails ArticlePubMed