BDBM50355136 CHEMBL1835771
SMILES Clc1ccc(Cn2nc(-c3ccc(OCCCN4CCCCC4)cc3)c3ccccc3c2=O)cc1
InChI Key InChIKey=ZYVKPPAFYWDVQZ-UHFFFAOYSA-N
Data  2 KI
  Tab Delimited (TSV)   2D SDfile   Computed 3D by Vconf -m prep SDfile
Find this compound or compounds like it in BindingDB:
Activity Spreadsheet -- Enzyme Inhibition Constant Data from BindingDB
Found 2 hits for monomerid = 50355136
TargetHistamine H3 receptor(Homo sapiens (Human))
Cephalon
Curated by ChEMBL
LigandPNGBDBM50355136(CHEMBL1835771)
Affinity DataKi:  11nM. Assay description: Displacement of [3H]-NAMH from human histamine H3 receptor expressed in CHO cells
In DepthDetails ArticlePubMed
TargetHistamine H3 receptor(Rattus norvegicus (rat))
Cephalon
Curated by ChEMBL
LigandPNGBDBM50355136(CHEMBL1835771)
Affinity DataKi:  23nM. Assay description: Displacement of [3H]-NAMH from rat histamine H3 receptor expressed in CHO cells
In DepthDetails ArticlePubMed