BDBM50355154 CHEMBL1834695
SMILES COc1ccc(NC(=O)Nc2nc3nn(C)cc3c3nc(nn23)-c2ccc(cc2)C(F)(F)F)cc1
InChI Key InChIKey=AOWMFZKPFZJQQU-UHFFFAOYSA-N
Data  4 KI
  Tab Delimited (TSV)   2D SDfile   Computed 3D by Vconf -m prep SDfile
Find this compound or compounds like it in BindingDB:
Activity Spreadsheet -- Enzyme Inhibition Constant Data from BindingDB
Found 4 hits for monomerid = 50355154
TargetAdenosine receptor A3(Homo sapiens (Human))
National University Of Singapore
Curated by ChEMBL
LigandPNGBDBM50355154(CHEMBL1834695)
Affinity DataKi:  2.36nM. Assay description: Displacement of [3H]NECA from human recombinant adenosine A3 receptor expressed in CHO cells after 3 hrs
In DepthDetails ArticlePubMed
TargetAdenosine receptor A2b(Homo sapiens (Human))
National University Of Singapore
Curated by ChEMBL
LigandPNGBDBM50355154(CHEMBL1834695)
Affinity DataKi: >1.00E+4nM. Assay description: Antagonist activity human recombinant adenosine 2B receptor expressed in CHO cells assessed as inhibition of NECA-stimulated adenylyl cyclase activit...
In DepthDetails ArticlePubMed
TargetAdenosine receptor A2a(Homo sapiens (Human))
National University Of Singapore
Curated by ChEMBL
LigandPNGBDBM50355154(CHEMBL1834695)
Affinity DataKi: >1.00E+5nM. Assay description: Displacement of [3H]NECA from human recombinant adenosine 2A receptor expressed in CHO cells after 3 hrs
In DepthDetails ArticlePubMed
TargetAdenosine receptor A1(Homo sapiens (Human))
National University Of Singapore
Curated by ChEMBL
LigandPNGBDBM50355154(CHEMBL1834695)
Affinity DataKi: >1.00E+5nM. Assay description: Displacement of [3H]CCPA from human recombinant adenosine A1 receptor expressed in CHO cells after 3 hrs
In DepthDetails ArticlePubMed