BDBM50356469 CHEMBL1911857
SMILES O=C1CC(=NCC2(CN3CCC2CC3)N1)c1cccs1
InChI Key InChIKey=SEBTWINJQGHHDX-UHFFFAOYSA-N
Data  1 KI
  Tab Delimited (TSV)   2D SDfile   Computed 3D by Vconf -m prep SDfile
Find this compound or compounds like it in BindingDB:
Activity Spreadsheet -- Enzyme Inhibition Constant Data from BindingDB
Found 1 hit for monomerid = 50356469
TargetNeuronal acetylcholine receptor subunit alpha-7(Rattus norvegicus (Rat))
Targacept
Curated by ChEMBL
LigandPNGBDBM50356469(CHEMBL1911857)
Affinity DataKi:  58nM. Assay description: Displacement of [3H]-methyllycaconitine from alpha7 nAChR in rat hippocampal membranes after 2 hrs by liquid scintillation counting
In DepthDetails ArticlePubMed