BDBM50356595 CHEMBL1910109
SMILES CSc1ccccc1N1Cc2c(nc(C)c(CN)c2-c2ccc(Cl)cc2Cl)C1=O
InChI Key InChIKey=QTLDSTDJXWDBOP-UHFFFAOYSA-N
Data  3 KI
  Tab Delimited (TSV)   2D SDfile   Computed 3D by Vconf -m prep SDfile
Find this compound or compounds like it in BindingDB:
Activity Spreadsheet -- Enzyme Inhibition Constant Data from BindingDB
Found 3 hits for monomerid = 50356595
TargetDipeptidyl peptidase 4(Homo sapiens (Human))
Bristol-Myers Squibb Research And Development
Curated by ChEMBL
LigandPNGBDBM50356595(CHEMBL1910109)
Affinity DataKi:  12nM. Assay description: Inhibition of DPP4
In DepthDetails ArticlePubMed
TargetDipeptidyl peptidase 8(Homo sapiens (Human))
Bristol-Myers Squibb Research And Development
Curated by ChEMBL
LigandPNGBDBM50356595(CHEMBL1910109)
Affinity DataKi:  1.24E+3nM. Assay description: Inhibition of DPP8
In DepthDetails ArticlePubMed
TargetDipeptidyl peptidase 9(Homo sapiens (Human))
Bristol-Myers Squibb Research And Development
Curated by ChEMBL
LigandPNGBDBM50356595(CHEMBL1910109)
Affinity DataKi:  2.30E+3nM. Assay description: Inhibition of DPP9
In DepthDetails ArticlePubMed