BDBM503572 6-[4-[3-(4-oxo-3H-quinazolin-2-yl)propanoyl]piperazin-1-yl]pyridine-3-carboxamide::US11034670, Ex. 12
SMILES NC(=O)c1ccc(nc1)N1CCN(CC1)C(=O)CCc1nc2ccccc2c(=O)[nH]1
InChI Key InChIKey=GOKAGXRRSZYYST-UHFFFAOYSA-N
Data  1 IC50
  Tab Delimited (TSV)   2D SDfile   Computed 3D by Vconf -m prep SDfile
Find this compound or compounds like it in BindingDB:
Activity Spreadsheet -- Enzyme Inhibition Constant Data from BindingDB
Found 1 hit for monomerid = 503572
TargetPoly [ADP-ribose] polymerase 1(Homo sapiens (Human))
Mitobridge
US Patent
LigandPNGBDBM503572(6-[4-[3-(4-oxo-3H-quinazolin-2-yl)propanoyl]pipera...)
Affinity DataIC50:  25nM. Assay description: The scintillation proximity assay (SPA) is designed to measure PARP activity using purified recombinant PARP-1 enzyme and is ideal for high throughpu...
Ligand InfoPC cidPC sid
In DepthDetails US Patent