BDBM50357400 CHEMBL1917484
SMILES OC[C@H]1O[C@H](Cn2cc(nn2)-c2ccc(cc2)C(F)(F)F)[C@@H](O)[C@@H](O)[C@@H]1O
InChI Key InChIKey=KWBFSKLNZPGOPH-KJWHEZOQSA-N
Data  1 IC50
  Tab Delimited (TSV)   2D SDfile   Computed 3D by Vconf -m prep SDfile
Find this compound or compounds like it in BindingDB:
Activity Spreadsheet -- Enzyme Inhibition Constant Data from BindingDB
Found 1 hit for monomerid = 50357400
TargetType 1 fimbrin D-mannose specific adhesin(Escherichia coli (strain K12))
University Of Basel
Curated by ChEMBL
LigandPNGBDBM50357400(CHEMBL1917484)
Affinity DataIC50:  194nM. Assay description: Antagonist activity at Escherichia coli recombinant C-terminal 6His-tagged FimH-CRD with a C-terminal thrombin cleavage site expressed in Escherichia...
In DepthDetails ArticlePubMed