BDBM50357420 CHEMBL1917477
SMILES Cc1ccc(cc1)-c1cn(nn1)[C@H]1O[C@H](CO)[C@@H](O)[C@H](O)[C@@H]1O
InChI Key InChIKey=GPKJBGDVSSJYIY-MRLBHPIUSA-N
Data  1 IC50
  Tab Delimited (TSV)   2D SDfile   Computed 3D by Vconf -m prep SDfile
Find this compound or compounds like it in BindingDB:
Activity Spreadsheet -- Enzyme Inhibition Constant Data from BindingDB
Found 1 hit for monomerid = 50357420
TargetType 1 fimbrin D-mannose specific adhesin(Escherichia coli (strain K12))
University Of Basel
Curated by ChEMBL
LigandPNGBDBM50357420(CHEMBL1917477)
Affinity DataIC50:  248nM. Assay description: Antagonist activity at Escherichia coli recombinant C-terminal 6His-tagged FimH-CRD with a C-terminal thrombin cleavage site expressed in Escherichia...
In DepthDetails ArticlePubMed