BDBM50357489 CHEMBL1914472
SMILES CCC(C)[C@]1(CCN([C@@H](CCc2ccccc2)C(=O)N[C@@H](Cc2cc(F)cc(F)c2)[C@H](O)CNCc2cccc(OC)c2)C1=O)NC(C)=O
InChI Key InChIKey=RCAZOLSIRITUKZ-VHVJLOLGSA-N
Data  3 IC50
  Tab Delimited (TSV)   2D SDfile   Computed 3D by Vconf -m prep SDfile
Find this compound or compounds like it in BindingDB:
Activity Spreadsheet -- Enzyme Inhibition Constant Data from BindingDB
Found 3 hits for monomerid = 50357489
TargetBeta-secretase 1(Homo sapiens (Human))
Bristol-Myers Squibb
Curated by ChEMBL
LigandPNGBDBM50357489(CHEMBL1914472)
Affinity DataIC50:  6.10nM. Assay description: Inhibition of BACE1 by HPLC method
In DepthDetails ArticlePubMed
TargetBeta-secretase 1(Homo sapiens (Human))
Bristol-Myers Squibb
Curated by ChEMBL
LigandPNGBDBM50357489(CHEMBL1914472)
Affinity DataIC50:  3nM. Assay description: Inhibition of BACE-1 in human HEK293 cells overexpressing APP 695 swedish mutation assessed as inhibition of amyloid beta (1 to 40) production by ELI...
In DepthDetails ArticlePubMed
TargetBeta-secretase 1(Homo sapiens (Human))
Bristol-Myers Squibb
Curated by ChEMBL
LigandPNGBDBM50357489(CHEMBL1914472)
Affinity DataIC50:  2nM. Assay description: Displacement of [3H]BMS-599240 from recombinant human BACE-1
In DepthDetails ArticlePubMed