BDBM50357496 CHEMBL1914623
SMILES CN1CCc2ccc(cc2CC1)C(=O)CCCN1CCC(CC1)c1ccc(Cl)cc1
InChI Key InChIKey=ASIGWAMOEPENOF-UHFFFAOYSA-N
Data  2 IC50
  Tab Delimited (TSV)   2D SDfile   Computed 3D by Vconf -m prep SDfile
Find this compound or compounds like it in BindingDB:
Activity Spreadsheet -- Enzyme Inhibition Constant Data from BindingDB
Found 2 hits for monomerid = 50357496
TargetMelanin-concentrating hormone receptor 1(Homo sapiens (Human))
Takeda Pharmaceutical
Curated by ChEMBL
LigandPNGBDBM50357496(CHEMBL1914623)
Affinity DataIC50:  34nM. Assay description: Antagonist activity at human MCHR1 expressed in CHO cells assessed as inhibition of MCH-stimulated arachidonic acid release
In DepthDetails ArticlePubMed
TargetMelanin-concentrating hormone receptor 1(Homo sapiens (Human))
Takeda Pharmaceutical
Curated by ChEMBL
LigandPNGBDBM50357496(CHEMBL1914623)
Affinity DataIC50:  0.960nM. Assay description: Displacement of [125I]-MCH(4-19) from human MCHR1 expressed in CHO cells
In DepthDetails ArticlePubMed