BDBM50358278 CHEMBL1922394
SMILES Oc1ccc(cc1)C(c1cc(Br)c(O)cc1O)c1cc(Br)c(O)cc1O
InChI Key InChIKey=WDTFLUBJKIQEJJ-UHFFFAOYSA-N
Data  1 IC50
  Tab Delimited (TSV)   2D SDfile   Computed 3D by Vconf -m prep SDfile
Find this compound or compounds like it in BindingDB:
Activity Spreadsheet -- Enzyme Inhibition Constant Data from BindingDB
Found 1 hit for monomerid = 50358278
TargetIsocitrate lyase(Candida albicans)
University Of East Anglia
Curated by ChEMBL
LigandPNGBDBM50358278(CHEMBL1922394)
Affinity DataIC50:  2.59E+4nM. Assay description: Inhibition of Candida albicans isocitrate lyase after 30 mins
In DepthDetails ArticlePubMed