BDBM50358279 CHEMBL1922395
SMILES Oc1cc(O)c(cc1Br)C(c1cc(Br)c(O)cc1O)c1c(Cl)cccc1Cl
InChI Key InChIKey=FXVGJORNNXWQIL-UHFFFAOYSA-N
Data  1 IC50
  Tab Delimited (TSV)   2D SDfile   Computed 3D by Vconf -m prep SDfile
Find this compound or compounds like it in BindingDB:
Activity Spreadsheet -- Enzyme Inhibition Constant Data from BindingDB
Found 1 hit for monomerid = 50358279
TargetIsocitrate lyase(Candida albicans)
University Of East Anglia
Curated by ChEMBL
LigandPNGBDBM50358279(CHEMBL1922395)
Affinity DataIC50:  1.79E+4nM. Assay description: Inhibition of Candida albicans isocitrate lyase after 30 mins
In DepthDetails ArticlePubMed