BDBM50358532 CHEMBL1923521
SMILES C(c1ccccc1)c1ccccc1OC1CCNCC1
InChI Key InChIKey=FZBQOBOSIQUVSG-UHFFFAOYSA-N
Data  2 KI
  Tab Delimited (TSV)   2D SDfile   Computed 3D by Vconf -m prep SDfile
Find this compound or compounds like it in BindingDB:
Activity Spreadsheet -- Enzyme Inhibition Constant Data from BindingDB
Found 2 hits for monomerid = 50358532
TargetHistamine H1 receptor(Homo sapiens (Human))
Vu University Amsterdam
Curated by ChEMBL
LigandPNGBDBM50358532(CHEMBL1923521)
Affinity DataKi:  6.30nM. Assay description: Displacement of [3H]mepyramine from human histamine H1 receptor expressed in HEK293 cells after 1 to 1.5 hrs by scintillation counting
In DepthDetails ArticlePubMed
TargetHistamine H1 receptor(Homo sapiens (Human))
Vu University Amsterdam
Curated by ChEMBL
LigandPNGBDBM50358532(CHEMBL1923521)
Affinity DataKi:  16nM. Assay description: Displacement of [3H]mepyramine from human wild type N-terminal hemagglutinin-tagged histamine H1 receptor expressed in HEK293T cells after 4 hrs by m...
In DepthDetails ArticlePubMed