BDBM50359057 CHEMBL1922528
SMILES COc1ccc(cn1)-c1ccc(Cn2c(CC(C)(C)C(O)=O)c(SC(C)(C)C)c3cc(OCc4cn5ccccc5n4)ccc23)cc1
InChI Key InChIKey=HLYCGSYGOOHELT-UHFFFAOYSA-N
Data  4 IC50
  Tab Delimited (TSV)   2D SDfile   Computed 3D by Vconf -m prep SDfile
Find this compound or compounds like it in BindingDB:
Activity Spreadsheet -- Enzyme Inhibition Constant Data from BindingDB
Found 4 hits for monomerid = 50359057
TargetArachidonate 5-lipoxygenase-activating protein(Homo sapiens (Human))
Amira Pharmaceuticals
Curated by ChEMBL
LigandPNGBDBM50359057(CHEMBL1922528)
Affinity DataIC50:  552nM. Assay description: Inhibition of FLAP in human whole blood assessed as inhibition of calcium ionophore A23187-induced LTB4 production preincubated for 5 hrs by ELISA
In DepthDetails ArticlePubMed
TargetArachidonate 5-lipoxygenase-activating protein(Homo sapiens (Human))
Amira Pharmaceuticals
Curated by ChEMBL
LigandPNGBDBM50359057(CHEMBL1922528)
Affinity DataIC50:  8.90nM. Assay description: Displacement of [3H]-3-[5-(pyrid-2-ylmethoxy)-3-tert-butylthio-1-benzylindol-2-yl]-2,2-dimethylpropionic acid from FLAP in human polymorphonuclear ce...
In DepthDetails ArticlePubMed
TargetArachidonate 5-lipoxygenase-activating protein(Homo sapiens (Human))
Amira Pharmaceuticals
Curated by ChEMBL
LigandPNGBDBM50359057(CHEMBL1922528)
Affinity DataIC50:  1.40nM. Assay description: Inhibition of FLAP in human peripheral leukocytes assessed as inhibition of calcium ionophore A23187-induced LTB4 production after 10 mins by ELISA
In DepthDetails ArticlePubMed
TargetArachidonate 5-lipoxygenase-activating protein(Homo sapiens (Human))
Amira Pharmaceuticals
Curated by ChEMBL
LigandPNGBDBM50359057(CHEMBL1922528)
Affinity DataIC50:  980nM. Assay description: Inhibition of FLAP in human whole blood assessed as inhibition of calcium ionophore A23187-induced LTB4 production preincubated for 15 mins by ELISA
In DepthDetails ArticlePubMed