BDBM50359077 CHEMBL1922657
SMILES Cc1ccc(COc2ccc3n(Cc4ccc(cc4)-c4ccc(nc4)C(F)(F)F)c(CC(C)(C)C(O)=O)c(SC(C)(C)C)c3c2)nc1
InChI Key InChIKey=VMGLVOXLDYLNMD-UHFFFAOYSA-N
Data  4 IC50
  Tab Delimited (TSV)   2D SDfile   Computed 3D by Vconf -m prep SDfile
Find this compound or compounds like it in BindingDB:
Activity Spreadsheet -- Enzyme Inhibition Constant Data from BindingDB
Found 4 hits for monomerid = 50359077
TargetArachidonate 5-lipoxygenase-activating protein(Homo sapiens (Human))
Amira Pharmaceuticals
Curated by ChEMBL
LigandPNGBDBM50359077(CHEMBL1922657)
Affinity DataIC50:  180nM. Assay description: Inhibition of FLAP in human whole blood assessed as inhibition of calcium ionophore A23187-induced LTB4 production preincubated for 5 hrs by ELISA
In DepthDetails ArticlePubMed
TargetArachidonate 5-lipoxygenase-activating protein(Homo sapiens (Human))
Amira Pharmaceuticals
Curated by ChEMBL
LigandPNGBDBM50359077(CHEMBL1922657)
Affinity DataIC50:  3.20nM. Assay description: Displacement of [3H]-3-[5-(pyrid-2-ylmethoxy)-3-tert-butylthio-1-benzylindol-2-yl]-2,2-dimethylpropionic acid from FLAP in human polymorphonuclear ce...
In DepthDetails ArticlePubMed
TargetArachidonate 5-lipoxygenase-activating protein(Homo sapiens (Human))
Amira Pharmaceuticals
Curated by ChEMBL
LigandPNGBDBM50359077(CHEMBL1922657)
Affinity DataIC50:  0.400nM. Assay description: Inhibition of FLAP in human peripheral leukocytes assessed as inhibition of calcium ionophore A23187-induced LTB4 production after 10 mins by ELISA
In DepthDetails ArticlePubMed
TargetArachidonate 5-lipoxygenase-activating protein(Homo sapiens (Human))
Amira Pharmaceuticals
Curated by ChEMBL
LigandPNGBDBM50359077(CHEMBL1922657)
Affinity DataIC50:  401nM. Assay description: Inhibition of FLAP in human whole blood assessed as inhibition of calcium ionophore A23187-induced LTB4 production preincubated for 15 mins by ELISA
In DepthDetails ArticlePubMed