BDBM50359966 CHEMBL1927085
SMILES C=CCN1CCN(CCCN=C(NC#N)c2ccccn2)CC1
InChI Key InChIKey=XJUWBUDPNJJTPD-UHFFFAOYSA-N
Data  1 KI
  Tab Delimited (TSV)   2D SDfile   Computed 3D by Vconf -m prep SDfile
Find this compound or compounds like it in BindingDB:
Activity Spreadsheet -- Enzyme Inhibition Constant Data from BindingDB
Found 1 hit for monomerid = 50359966
Target5-hydroxytryptamine receptor 2C(Rattus norvegicus (Rat))
Universit£
Curated by ChEMBL
LigandPNGBDBM50359966(CHEMBL1927085)
Affinity DataKi: >1.00E+4nM. Assay description: Displacement of [3H]mesulergine from Sprague-Dawley rat brain cortex serotonin 5-HT2C receptor after 15 mins by liquid scintillation counting in pres...
In DepthDetails ArticlePubMed