BDBM50359990 PRUNETIN
SMILES COc1cc(O)c2c(c1)occ(-c1ccc(O)cc1)c2=O
InChI Key InChIKey=KQMVAGISDHMXJJ-UHFFFAOYSA-N
Data  1 KI  2 IC50
  Tab Delimited (TSV)   2D SDfile   Computed 3D by Vconf -m prep SDfile
Find this compound or compounds like it in BindingDB:
Activity Spreadsheet -- Enzyme Inhibition Constant Data from BindingDB
Found 3 hits for monomerid = 50359990
TargetAldehyde dehydrogenase, mitochondrial(Homo sapiens (Human))
University Of Oxford
Curated by ChEMBL
LigandPNGBDBM50359990(PRUNETIN)
Affinity DataKi:  450nM. Assay description: Inhibition of human recombinant ALDH2
In DepthDetails ArticlePubMed
TargetEpidermal growth factor receptor(Homo sapiens (Human))
TBA
Curated by ChEMBL
LigandPNGBDBM50359990(PRUNETIN)
Affinity DataIC50:  1.40E+4nM. Assay description: Inhibition of EGFR in human A431 cells
In DepthDetails ArticlePubMed
TargetNitric oxide synthase, inducible(Mus musculus (mouse))
Kaohsiung Medical University
Curated by ChEMBL
LigandPNGBDBM50359990(PRUNETIN)
Affinity DataIC50:  1.05E+4nM. Assay description: Inhibition of iNOS-mediated NO production in LPS-stimulated mouse RAW264.7 cells after 24 hrs by Griess reagent method
In DepthDetails ArticlePubMed