BDBM503600 US11034670, Ex. 40
SMILES O=C(CCc1nc2ccccc2c(=O)[nH]1)N1CCN(CC1)c1ncc(s1)C#N
InChI Key InChIKey=HWALGPHFTLHIJH-UHFFFAOYSA-N
Data  1 IC50
  Tab Delimited (TSV)   2D SDfile   Computed 3D by Vconf -m prep SDfile
Find this compound or compounds like it in BindingDB:
Activity Spreadsheet -- Enzyme Inhibition Constant Data from BindingDB
Found 1 hit for monomerid = 503600
TargetPoly [ADP-ribose] polymerase 1(Homo sapiens (Human))
Mitobridge
US Patent
LigandPNGBDBM503600(US11034670, Ex. 40)
Affinity DataIC50:  53nM. Assay description: The scintillation proximity assay (SPA) is designed to measure PARP activity using purified recombinant PARP-1 enzyme and is ideal for high throughpu...
Ligand InfoPC cidPC sid
In DepthDetails US Patent