BDBM50360547 CHEMBL1933164
SMILES O=C(Nc1cc(ccn1)-c1cc2c([nH]1)C1(CCNCC1)CNC2=O)c1ccc2ccccc2c1
InChI Key InChIKey=DWRIDLORHRQUGO-UHFFFAOYSA-N
Data  2 EC50
  Tab Delimited (TSV)   2D SDfile   Computed 3D by Vconf -m prep SDfile
Find this compound or compounds like it in BindingDB:
Activity Spreadsheet -- Enzyme Inhibition Constant Data from BindingDB
Found 2 hits for monomerid = 50360547
TargetMAP kinase-activated protein kinase 2(Homo sapiens (Human))
Merck Research Laboratories
Curated by ChEMBL
LigandPNGBDBM50360547(CHEMBL1933164)
Affinity DataEC50:  0.720nM. Assay description: Inhibition of MK2 using Fluo-betaA-11A NeoMPS as substrate pre-incubated for 30 mins before substrate addition measured after 2 hrs by IMAP assay
In DepthDetails ArticlePubMed
TargetMAP kinase-activated protein kinase 2(Homo sapiens (Human))
Merck Research Laboratories
Curated by ChEMBL
LigandPNGBDBM50360547(CHEMBL1933164)
Affinity DataEC50:  280nM. Assay description: Inhibition of MK2-mediated HSP27 phosphorylation in LPS-stimulated human THP1 cells pre-incubated for 60 mins prior to LPS-induction measured after 6...
In DepthDetails ArticlePubMed