BDBM50360549 CHEMBL1933193
SMILES O=C(Nc1cc(ccn1)-c1cc2c([nH]1)C1(CCNC1)CNC2=O)c1ccccn1
InChI Key InChIKey=KUHJGHADZLHBNB-UHFFFAOYSA-N
Data  2 EC50
  Tab Delimited (TSV)   2D SDfile   Computed 3D by Vconf -m prep SDfile
Find this compound or compounds like it in BindingDB:
Activity Spreadsheet -- Enzyme Inhibition Constant Data from BindingDB
Found 2 hits for monomerid = 50360549
TargetMAP kinase-activated protein kinase 2(Homo sapiens (Human))
Merck Research Laboratories
Curated by ChEMBL
LigandPNGBDBM50360549(CHEMBL1933193)
Affinity DataEC50:  660nM. Assay description: Inhibition of MK2-mediated HSP27 phosphorylation in LPS-stimulated human THP1 cells pre-incubated for 60 mins prior to LPS-induction measured after 6...
In DepthDetails ArticlePubMed
TargetMAP kinase-activated protein kinase 2(Homo sapiens (Human))
Merck Research Laboratories
Curated by ChEMBL
LigandPNGBDBM50360549(CHEMBL1933193)
Affinity DataEC50:  4.10nM. Assay description: Inhibition of MK2 using Fluo-betaA-11A NeoMPS as substrate pre-incubated for 30 mins before substrate addition measured after 2 hrs by IMAP assay
In DepthDetails ArticlePubMed