BDBM50360573 CHEMBL1933169
SMILES CN1CCC2(CC1)CNC(=O)c1cc([nH]c21)-c1ccnc(NC(=O)c2ccc(C)c(C)c2)c1
InChI Key InChIKey=OAVAWUCQTZYDRR-UHFFFAOYSA-N
Data  2 EC50
  Tab Delimited (TSV)   2D SDfile   Computed 3D by Vconf -m prep SDfile
Find this compound or compounds like it in BindingDB:
Activity Spreadsheet -- Enzyme Inhibition Constant Data from BindingDB
Found 2 hits for monomerid = 50360573
TargetMAP kinase-activated protein kinase 2(Homo sapiens (Human))
Merck Research Laboratories
Curated by ChEMBL
LigandPNGBDBM50360573(CHEMBL1933169)
Affinity DataEC50:  2.30nM. Assay description: Inhibition of MK2 using Fluo-betaA-11A NeoMPS as substrate pre-incubated for 30 mins before substrate addition measured after 2 hrs by IMAP assay
In DepthDetails ArticlePubMed
TargetMAP kinase-activated protein kinase 2(Homo sapiens (Human))
Merck Research Laboratories
Curated by ChEMBL
LigandPNGBDBM50360573(CHEMBL1933169)
Affinity DataEC50:  920nM. Assay description: Inhibition of MK2-mediated HSP27 phosphorylation in LPS-stimulated human THP1 cells pre-incubated for 60 mins prior to LPS-induction measured after 6...
In DepthDetails ArticlePubMed