BDBM50361323 CHEMBL1935750
SMILES COc1ccc(NC(=O)Nc2nc3cn(CCCc4ccccc4)cc3c3nc(nn23)-c2ccco2)cc1
InChI Key InChIKey=ZMRKZXCDAWJGSF-UHFFFAOYSA-N
Data  3 KI  1 IC50
  Tab Delimited (TSV)   2D SDfile   Computed 3D by Vconf -m prep SDfile
Find this compound or compounds like it in BindingDB:
Activity Spreadsheet -- Enzyme Inhibition Constant Data from BindingDB
Found 4 hits for monomerid = 50361323
TargetAdenosine receptor A3(Homo sapiens (Human))
Universit£
Curated by ChEMBL
LigandPNGBDBM50361323(CHEMBL1935750)
Affinity DataKi:  13nM. Assay description: Displacement of [3H]-MRE-3008-F20 from human adenosine A3 receptor expressed in CHO cells after 120 mins by liquid scintillation counting
In DepthDetails ArticlePubMed
TargetAdenosine receptor A2a(Homo sapiens (Human))
Universit£
Curated by ChEMBL
LigandPNGBDBM50361323(CHEMBL1935750)
Affinity DataKi:  130nM. Assay description: Displacement of [3H]-ZM 241385 from human adenosine A2A receptor expressed in CHO cells after 60 mins by liquid scintillation counting
In DepthDetails ArticlePubMed
TargetAdenosine receptor A1(Homo sapiens (Human))
Universit£
Curated by ChEMBL
LigandPNGBDBM50361323(CHEMBL1935750)
Affinity DataKi:  210nM. Assay description: Displacement of [3H]-DPCPX from human adenosine A1 receptor expressed in CHO cells after 120 mins by liquid scintillation counting
In DepthDetails ArticlePubMed
TargetAdenosine receptor A2b(Homo sapiens (Human))
Universit£
Curated by ChEMBL
LigandPNGBDBM50361323(CHEMBL1935750)
Affinity DataIC50: >1.00E+3nM. Assay description: Antagonist activity at human adenosine A2B receptor expressed in CHO cells assessed as inhibition of NECA-induced cAMP production by competition prot...
In DepthDetails ArticlePubMed