BDBM50361603 CHEMBL1939848
SMILES CCn1ccc(c1)N1C[C@H](CO)OC1=O
InChI Key InChIKey=UXJWVVONZXRBQC-SECBINFHSA-N
Data  2 KI
  Tab Delimited (TSV)   2D SDfile   Computed 3D by Vconf -m prep SDfile
Find this compound or compounds like it in BindingDB:
Activity Spreadsheet -- Enzyme Inhibition Constant Data from BindingDB
Found 2 hits for monomerid = 50361603
TargetAmine oxidase [flavin-containing] A(Bos taurus)
Sapienza University Of Rome
Curated by ChEMBL
LigandPNGBDBM50361603(CHEMBL1939848)
Affinity DataKi:  3nM. Assay description: Inhibition of bovine brain MAOA using kynuramine as a substrate after 30 mins by spectrofluorometric method
In DepthDetails ArticlePubMed
TargetAmine oxidase [flavin-containing] B(Bos taurus)
Sapienza University Of Rome
Curated by ChEMBL
LigandPNGBDBM50361603(CHEMBL1939848)
Affinity DataKi:  300nM. Assay description: Inhibition of bovine brain MAOB using kynuramine as a substrate after 30 mins by spectrofluorometric method
In DepthDetails ArticlePubMed