BDBM50361902 CHEMBL1938947
SMILES Cn1cc(C(=O)Nc2ccc(-c3cccnc3)c(c2)C(F)(F)F)c(=O)c2ccccc12
InChI Key InChIKey=QOFDJYAYOCDSDG-UHFFFAOYSA-N
Data  3 EC50
  Tab Delimited (TSV)   2D SDfile   Computed 3D by Vconf -m prep SDfile
Find this compound or compounds like it in BindingDB:
Activity Spreadsheet -- Enzyme Inhibition Constant Data from BindingDB
Found 3 hits for monomerid = 50361902
TargetSphingosine 1-phosphate receptor 1(Homo sapiens (Human))
Amgen
Curated by ChEMBL
LigandPNGBDBM50361902(CHEMBL1938947)
Affinity DataEC50:  310nM. Assay description: Agonist activity at human S1P1 receptor expressed in human U2OS cells co-expressing eGFP assessed as receptor internalization into cytoplasm using Ho...
In DepthDetails ArticlePubMed
TargetSphingosine 1-phosphate receptor 1(Homo sapiens (Human))
Amgen
Curated by ChEMBL
LigandPNGBDBM50361902(CHEMBL1938947)
Affinity DataEC50:  310nM. Assay description: Agonist activity at S1P1 (unknown origin)
In DepthDetails ArticlePubMed
TargetSphingosine 1-phosphate receptor 3(Homo sapiens (Human))
Amgen
Curated by ChEMBL
LigandPNGBDBM50361902(CHEMBL1938947)
Affinity DataEC50:  2.50E+3nM. Assay description: Agonist activity at human S1P3 receptor expressed in CHO-K1 cells co-expressing Gq/i5 G-protein assessed as calcium mobilization by FLIPR assay
In DepthDetails ArticlePubMed