BDBM503625 US11034671, Example 12
SMILES Brc1ccc2OCCC\C=C/Cn3cnnc3-c3cccc(NC(=O)c2c1)n3
InChI Key InChIKey=WOEUTCJXOUXZSP-IWQZZHSRSA-N
Data  1 Kd
  Tab Delimited (TSV)   2D SDfile   Computed 3D by Vconf -m prep SDfile
Find this compound or compounds like it in BindingDB:
Activity Spreadsheet -- Enzyme Inhibition Constant Data from BindingDB
Found 1 hit for monomerid = 503625
TargetMitogen-activated protein kinase kinase kinase 5(Homo sapiens (Human))
Sichuan Haisco Pharmaceutical
US Patent
LigandPNGBDBM503625(US11034671, Example 12)
Affinity DataKd:  300nM. Assay description: The binding of compounds to ASK1 were determined using DiscoverX's proprietary technology. KINOMEscan™ is based on a competition binding assay th...
Ligand InfoPC cidPC sid
In DepthDetails US Patent