BDBM503631 US11034671, Example 18
SMILES O=C1Nc2cccc(n2)-c2nncn2C\C=C\COc2ccc(OCc3ccccc3)cc12
InChI Key InChIKey=UYVFNOPZDAZDFG-SNAWJCMRSA-N
Data  1 Kd
  Tab Delimited (TSV)   2D SDfile   Computed 3D by Vconf -m prep SDfile
Find this compound or compounds like it in BindingDB:
Activity Spreadsheet -- Enzyme Inhibition Constant Data from BindingDB
Found 1 hit for monomerid = 503631
TargetMitogen-activated protein kinase kinase kinase 5(Homo sapiens (Human))
Sichuan Haisco Pharmaceutical
US Patent
LigandPNGBDBM503631(US11034671, Example 18)
Affinity DataKd: <100nM. Assay description: The binding of compounds to ASK1 were determined using DiscoverX's proprietary technology. KINOMEscan™ is based on a competition binding assay th...
Ligand InfoPC cidPC sid
In DepthDetails US Patent