BDBM50364411 CHEMBL1950482
SMILES OC(=O)c1ccc(-c2nc3ccc(nc3s2)C2(CC2)c2ccccc2)c(F)c1
InChI Key InChIKey=QZEFMXVLUXINLH-UHFFFAOYSA-N
Data  2 EC50
  Tab Delimited (TSV)   2D SDfile   Computed 3D by Vconf -m prep SDfile
Find this compound or compounds like it in BindingDB:
Activity Spreadsheet -- Enzyme Inhibition Constant Data from BindingDB
Found 2 hits for monomerid = 50364411
TargetSphingosine 1-phosphate receptor 3(Homo sapiens (Human))
Amgen
Curated by ChEMBL
LigandPNGBDBM50364411(CHEMBL1950482)
Affinity DataEC50: >2.50E+4nM. Assay description: Agonist activity at human S1P3 receptor expressed in CHO cells coexpressing chimeric Gq/i5 G-protein assessed as Ca2+ release by FLIPR assay
In DepthDetails ArticlePubMed
TargetSphingosine 1-phosphate receptor 1(Homo sapiens (Human))
Amgen
Curated by ChEMBL
LigandPNGBDBM50364411(CHEMBL1950482)
Affinity DataEC50:  2.82E+3nM. Assay description: Agonist activity at eGFP-tagged human S1P1 receptor expressed in U2OS cells assessed as receptor internalization after 1 hr by Hoechst dye-based micr...
In DepthDetails ArticlePubMed