BDBM50365062 CHEMBL1951072::Sulfonamide, 1
SMILES COc1cc(OC)c(cc1NC(C)=O)S(=O)(=O)N1C(C)Cc2ccccc12
InChI Key InChIKey=WCESRWVTCVMYMU-UHFFFAOYSA-N
Data  5 IC50
PDB links: 1 PDB ID matches this monomer.
  Tab Delimited (TSV)   2D SDfile   Computed 3D by Vconf -m prep SDfile
Find this compound or compounds like it in BindingDB:
Activity Spreadsheet -- Enzyme Inhibition Constant Data from BindingDB
Found 5 hits for monomerid = 50365062
TargetBifunctional protein GlmU(Escherichia coli)
Astrazeneca
LigandPNGBDBM50365062(CHEMBL1951072 | Sulfonamide, 1)
Affinity DataIC50:  2.10E+3nMpH: 7.35Assay Description:Inhibition assay using GlmU bifuncation enzyme with various bacterial strains.
TargetBifunctional protein GlmU(Haemophilus influenzae)
Astrazeneca
LigandPNGBDBM50365062(CHEMBL1951072 | Sulfonamide, 1)
Affinity DataIC50:  7.80E+3nMpH: 7.35Assay Description:Inhibition assay using GlmU bifuncation enzyme with various bacterial strains.
In DepthDetails ArticlePubMed
TargetBifunctional protein GlmU(Streptococcus pneumoniae)
Astrazeneca R&D Boston
Curated by ChEMBL
LigandPNGBDBM50365062(CHEMBL1951072 | Sulfonamide, 1)
Affinity DataIC50: >2.00E+5nM. Assay description: Inhibition of Streptococcus pneumoniae acetyltransferase activity of GlmU using acetyl-CoA and glucosamine-1-phosphate after 30 mins by Ellman's meth...
In DepthDetails ArticlePubMed
TargetBifunctional protein GlmU(Staphylococcus aureus)
Astrazeneca
LigandPNGBDBM50365062(CHEMBL1951072 | Sulfonamide, 1)
Affinity DataIC50: >2.00E+5nMpH: 7.35Assay Description:Inhibition assay using GlmU bifuncation enzyme with various bacterial strains.
In DepthDetails ArticlePubMed
TargetBifunctional protein GlmU(Streptococcus pneumoniae)
Astrazeneca
LigandPNGBDBM50365062(CHEMBL1951072 | Sulfonamide, 1)
Affinity DataIC50: >2.00E+5nMpH: 7.35Assay Description:Inhibition assay using GlmU bifuncation enzyme with various bacterial strains.
In DepthDetails ArticlePubMed