BDBM50365095 CHEMBL1951184
SMILES COc1cc(OC)c(cc1NC(=O)CCC(O)=O)S(=O)(=O)NCc1ccccc1N1CCC(COC(=O)CCC(O)=O)CC1
InChI Key InChIKey=PRDHHOYRFMTLDT-UHFFFAOYSA-N
Data  3 IC50
PDB links: 1 PDB ID matches this monomer.
  Tab Delimited (TSV)   2D SDfile   Computed 3D by Vconf -m prep SDfile
Find this compound or compounds like it in BindingDB:
Activity Spreadsheet -- Enzyme Inhibition Constant Data from BindingDB
Found 3 hits for monomerid = 50365095
TargetBifunctional protein GlmU(Escherichia coli)
Csir-Indian Institute Of Integrative Medicine
Curated by ChEMBL
LigandPNGBDBM50365095(CHEMBL1951184)
Affinity DataIC50:  250nM. Assay description: Inhibition of Escherichia coli GlmU acetyltransferase activity assessed as coenzyme A production using acetyl CoA substrate
In DepthDetails ArticlePubMed
TargetBifunctional protein GlmU(Streptococcus pneumoniae)
Astrazeneca R&D Boston
Curated by ChEMBL
LigandPNGBDBM50365095(CHEMBL1951184)
Affinity DataIC50:  500nM. Assay description: Inhibition of Streptococcus pneumoniae acetyltransferase activity of GlmU using acetyl-CoA and glucosamine-1-phosphate after 30 mins by Ellman's meth...
TargetBifunctional protein GlmU(Escherichia coli)
Csir-Indian Institute Of Integrative Medicine
Curated by ChEMBL
LigandPNGBDBM50365095(CHEMBL1951184)
Affinity DataIC50:  250nM. Assay description: Inhibition of Escherichia coli GlmU acetyltransferase activity assessed as coenzyme A production using acetyl CoA substrate
In DepthDetails ArticlePubMed