BDBM503655 US11034671, Example 45
SMILES CC(C)N1[Na]=CC=C1c1ccc2OCCCCn3cnnc3-c3cccc(NC(=O)c2c1)n3
InChI Key InChIKey=NOUGDNIEJIFDPK-YOJQKEKBSA-N
Data  1 Kd
  Tab Delimited (TSV)   2D SDfile   Computed 3D by Vconf -m prep SDfile
Find this compound or compounds like it in BindingDB:
Activity Spreadsheet -- Enzyme Inhibition Constant Data from BindingDB
Found 1 hit for monomerid = 503655
TargetMitogen-activated protein kinase kinase kinase 5(Homo sapiens (Human))
Sichuan Haisco Pharmaceutical
US Patent
LigandPNGBDBM503655(US11034671, Example 45)
Affinity DataKd:  750nM. Assay description: The binding of compounds to ASK1 were determined using DiscoverX's proprietary technology. KINOMEscan™ is based on a competition binding assay th...
Ligand InfoPC cidPC sid
In DepthDetails US Patent