BDBM50365815 CHEMBL1956994
SMILES CC(C)N1CCC[C@H](Cn2c(C)nc3ccc(Oc4ccc(Br)cc4F)nc3c2=O)C1
InChI Key InChIKey=LMBFVVBQYYWDKN-INIZCTEOSA-N
Data  1 KI
PDB links: 1 PDB ID matches this monomer.
  Tab Delimited (TSV)   2D SDfile   Computed 3D by Vconf -m prep SDfile
Find this compound or compounds like it in BindingDB:
Activity Spreadsheet -- Enzyme Inhibition Constant Data from BindingDB
Found 1 hit for monomerid = 50365815
TargetGrowth hormone secretagogue receptor type 1(Homo sapiens (Human))
Prosidion
Curated by ChEMBL
LigandPNGBDBM50365815(CHEMBL1956994)
Affinity DataKi:  0.0100nM. Assay description: Displacement of [125I]-Ghrelin from human GHSR membranes overexpressing GSH-R1a by scintillation counting