BDBM50365824 CHEMBL1957003
SMILES CC(C)N1CCC[C@H](Cn2c(C)nc3cnc(Oc4ccc5n(C)cnc5c4)cc3c2=O)C1
InChI Key InChIKey=FRGRMZRHUBDUDQ-SFHVURJKSA-N
Data  1 KI
  Tab Delimited (TSV)   2D SDfile   Computed 3D by Vconf -m prep SDfile
Find this compound or compounds like it in BindingDB:
Activity Spreadsheet -- Enzyme Inhibition Constant Data from BindingDB
Found 1 hit for monomerid = 50365824
TargetGrowth hormone secretagogue receptor type 1(Homo sapiens (Human))
Prosidion
Curated by ChEMBL
LigandPNGBDBM50365824(CHEMBL1957003)
Affinity DataKi:  0.5nM. Assay description: Displacement of [125I]-Ghrelin from human GHSR membranes overexpressing GSH-R1a by scintillation counting
In DepthDetails ArticlePubMed