BDBM50366459 CHEMBL1790649
SMILES CC[C@H](C)[C@H](NC(=O)[C@@H]1CCCN1C[C@H](O)[C@H]1Cc2ccc(OCC(=O)N[C@@H](Cc3ccc(O)cc3)C(=O)N[C@@H](CC(N)=O)C(=O)N1)cc2)C(=O)N[C@@H](C(C)C)C(N)=O
InChI Key InChIKey=QSAYYRSROJGDHI-UFFKREFKSA-N
Data  1 KI
  Tab Delimited (TSV)   2D SDfile   Computed 3D by Vconf -m prep SDfile
Find this compound or compounds like it in BindingDB:
Activity Spreadsheet -- Enzyme Inhibition Constant Data from BindingDB
Found 1 hit for monomerid = 50366459
TargetGag-Pol polyprotein [489-587](Human immunodeficiency virus type 1)
TBA
Curated by ChEMBL
LigandPNGBDBM50366459(CHEMBL1790649)
Affinity DataKi:  11nM. Assay description: Inhibition of HIV-1 protease.
In DepthDetails Article