BDBM50367067 CHEMBL3350514::CHEMBL612174
SMILES CN(CCCCN(C)c1ncnc2n(cnc12)[C@@H]1O[C@H](COP(O)(=O)OP(O)(=O)OP(O)(O)=O)[C@@H](O)[C@H]1O)C(=O)CCCCCCNC(=O)CI
InChI Key InChIKey=OCEVXSZQAKIMSY-DIPOXBPVSA-N
Data  2 KI
  Tab Delimited (TSV)   2D SDfile   Computed 3D by Vconf -m prep SDfile
Find this compound or compounds like it in BindingDB:
Activity Spreadsheet -- Enzyme Inhibition Constant Data from BindingDB
Found 2 hits for monomerid = 50367067
TargetAdenylate kinase 2, mitochondrial(Rattus norvegicus)
TBA
Curated by ChEMBL
LigandPNGBDBM50367067(CHEMBL3350514 | CHEMBL612174)
Affinity DataKi:  1.60E+6nM. Assay description: Ability to inhibit rat adenylate kinase II, activity expressed as Inhibition constant
In DepthDetails ArticlePubMed
TargetGTP:AMP phosphotransferase AK3, mitochondrial(Rattus norvegicus)
TBA
Curated by ChEMBL
LigandPNGBDBM50367067(CHEMBL3350514 | CHEMBL612174)
Affinity DataKi:  2.10E+6nM. Assay description: Ability to inhibit rat adenylate kinase III, activity expressed as Inhibition constant; Competitive inhibition
In DepthDetails ArticlePubMed