BDBM50367269 CHEMBL605671
SMILES OC[C@H]1OC([C@H](O)[C@@H]1O)n1cnc2c(Nc3ccc(CC(=O)Nc4ccc(CC(=O)NCCNC(=O)CCCCC5SCC6NC(=O)NC56)cc4)cc3)ncnc12
InChI Key InChIKey=ZNSFGKYGFPLOOO-QIUQCGNASA-N
Data  1 KI
  Tab Delimited (TSV)   2D SDfile   Computed 3D by Vconf -m prep SDfile
Find this compound or compounds like it in BindingDB:
Activity Spreadsheet -- Enzyme Inhibition Constant Data from BindingDB
Found 1 hit for monomerid = 50367269
TargetAdenosine receptor A1(Rattus norvegicus (rat))
TBA
Curated by ChEMBL
LigandPNGBDBM50367269(CHEMBL605671)
Affinity DataKi:  11nM. Assay description: Inhibition of binding of 1 nM N6-[3H]cyclohexyladenosine to adenosine A1 receptor on rat cerebral cortical membranes.
In DepthDetails ArticlePubMed