BDBM50367277 CHEMBL606513
SMILES Cc1cccc(NC(=O)Cc2ccc(Nc3ncnc4n(cnc34)C3O[C@H](CO)[C@@H](O)[C@H]3O)cc2)c1
InChI Key InChIKey=LGOMUVCCAYMSQF-PMJLDSSESA-N
Data  1 KI
  Tab Delimited (TSV)   2D SDfile   Computed 3D by Vconf -m prep SDfile
Find this compound or compounds like it in BindingDB:
Activity Spreadsheet -- Enzyme Inhibition Constant Data from BindingDB
Found 1 hit for monomerid = 50367277
TargetAdenosine receptor A1(Rattus norvegicus (rat))
TBA
Curated by ChEMBL
LigandPNGBDBM50367277(CHEMBL606513)
Affinity DataKi:  2nM. Assay description: Inhibition of binding of 1 nM N6-[3H]cyclohexyladenosine to adenosine A1 receptor on rat cerebral cortical membranes.
In DepthDetails ArticlePubMed