BDBM50367500 CHEMBL608798
SMILES CCc1ccc(Nc2ncnc3n(cnc23)C2O[C@H](CO)[C@@H](O)[C@H]2O)cc1
InChI Key InChIKey=FXHOLBKPEQYDBA-PZGKNFOESA-N
Data  2 IC50
  Tab Delimited (TSV)   2D SDfile   Computed 3D by Vconf -m prep SDfile
Find this compound or compounds like it in BindingDB:
Activity Spreadsheet -- Enzyme Inhibition Constant Data from BindingDB
Found 2 hits for monomerid = 50367500
TargetAdenosine receptor A2a/A2b(Rattus norvegicus)
TBA
Curated by ChEMBL
LigandPNGBDBM50367500(CHEMBL608798)
Affinity DataIC50:  960nM. Assay description: Displacement of [3H]-NECA from adenosine A2 receptor of rat striatal membrane
In DepthDetails ArticlePubMed
TargetAdenosine receptor A1(Chick)
TBA
Curated by ChEMBL
LigandPNGBDBM50367500(CHEMBL608798)
Affinity DataIC50:  13nM. Assay description: Displacement of [125I]ABA from adenosine A1 receptor of chick cerebellar membrane
In DepthDetails ArticlePubMed